{"text_format":"1","workbook":"xlsx","n_sheets":2,"sheets":["Propiedad Intelectual","DATOS"],"not_rendered":{"charts":0,"images":3,"macros":1,"external_links":0,"defined_names":41,"comments":0,"pivot_tables":0},"unopened":[],"bounds":{"document_bytes":16777216,"sheet_cells":100000,"rows_first":2000,"rows_last":500,"rows_between":2000,"halvings":0,"cell_chars":16384,"cell_head_chars":4096},"cells_cut":0,"cells_raw":0,"read":"whole","date_system":"1900"}

{"sheet":"Propiedad Intelectual","index":0,"n_rows":57,"n_cols":6,"rows_kept":57,"cut":false,"hidden":false,"merged":[[17,1,17,3],[15,4,15,5],[23,1,23,5],[18,1,18,3],[18,4,18,5],[19,1,19,3],[19,4,19,5],[21,1,21,5],[22,1,22,5],[20,1,20,5],[7,1,7,5],[8,1,8,5],[9,1,9,5],[13,1,13,5],[56,0,56,5],[24,1,24,5],[52,1,52,3],[55,0,55,5],[53,0,53,5],[50,0,50,5],[38,0,38,5],[25,0,25,5],[54,0,54,5],[51,1,51,5],[15,1,15,3],[16,1,16,3],[20,0,22,0],[12,1,12,5],[10,0,11,0],[1,1,1,5],[0,0,0,5],[2,0,2,5],[3,1,3,5],[4,1,4,5],[16,4,16,5],[17,4,17,5],[15,0,19,0],[10,1,10,2],[10,3,10,5],[11,3,11,5],[11,1,11,2],[6,1,6,5]]}
["FORMULARIO PARA LA PRESENTACIÓN DE OBRAS"]
["Publicación científica","Escoja una opción:"]
["DATOS DE LA PROPUESTA"]
["Título"]
["Breve resumen de la obra"]
["Número de hojas de la obra (de corresponder)"]
["Impacto que generará la obra"]
["Público objetivo"]
["Estrategias de difusión de la obra a aplicar"]
["Especifique el aporte de la obra a la cátedra o malla curricular de su carrera (bibliografía sílabo)"]
["Seleccione una opción según corresponda","OBRAS",null,"COLABORACIÓN"]
[]
["Proyecto institucional del que se deriva:"]
["Centro de Investigación institucional"]
["Grupo de investigación institucional:","Seleccione un grupo:","Seleccione un grupo:","Seleccione un grupo:","Seleccione un grupo:","Seleccione un grupo:"]
["Líneas de investigación institucionales 2020-2022","LÍNEAS",null,null,"SUBLÍNEAS"]
[null,"Seleccione una línea de investigación:"]
[null,"Seleccione una línea de investigación:"]
[null,"Seleccione una línea de investigación:"]
[null,"Seleccione una línea de investigación:"]
["Campo/s detallado/s de conocimiento (Según Reglamento de armonización de la nomenclatura de títulos profesionales...)","Seleccione un campo detallado"]
[null,"Seleccione un campo detallado"]
[null,"Seleccione un campo detallado"]
["Pertinencia con la/s carrera/s:"]
["Observación adicional:"]
["AUTORES INTERNOS (con filiación UNACH)"]
["DATOS PERSONALES","Autor 1","Autor 2","Autor 3","Autor 4","Autor 5"]
["Cédula o Pasaporte"]
["Nombres"]
["Apellidos"]
["Fecha de nacimiento"]
["Dirección domiciliaria:\n(Especificar calles)"]
["Grado académico más alto","Escoja una opción:","Escoja una opción:","Escoja una opción:","Escoja una opción:","Escoja una opción:"]
["Facultad","Seleccione una facultad:","Seleccione una facultad:","Seleccione una facultad:","Seleccione una facultad:","Seleccione una facultad:"]
["Carrera/s"]
["Correo Electrónico Institucional"]
["Código ORCID"]
["Cargo (Docente, estudiante, personal administrativo UNACH)","Seleccione una opción","Seleccione una opción","Seleccione una opción","Seleccione una opción","Seleccione una opción"]
["AUTORES EXTERNOS (sin filiación UNACH)"]
["DATOS PERSONALES","Autor 1","Autor 2","Autor 3","Autor 4","Autor 5"]
["Cédula o Pasaporte"]
["Nombres"]
["Apellidos"]
["Fecha de nacimiento"]
["Dirección domiciliaria:\n(Especificar calles)"]
["Grado académico más alto","Escoja una opción:","Escoja una opción:","Escoja una opción:","Escoja una opción:","Escoja una opción:"]
["Filiación"]
["Correo Electrónico Institucional"]
["Código ORCID"]
["Cargo que desempeña (Docente, estudiante, etc.)","Seleccione una opción","Seleccione una opción","Seleccione una opción","Seleccione una opción","Seleccione una opción"]
["DATOS DEL SOLICITANTE DE LA PROPUESTA"]
["Nombres del solicitante:"]
["Correo electrónico",null,null,null,"Celular:"]
["Declaro y me responsabilizo que toda la información contenida y emitida para este proceso es verídica, y eximo a la Dirección de Investigación de responsabilidad alguna. En caso de que se compruebe la falsedad de la información autorizo a la Institución tomar las acciones legales que correspondan."]
["Firma del solicitante"]
["Correo electrónico de la GCPI: gcpi@unach.edu.ec "]
["http://investigacion.unach.edu.ec"]

{"sheet":"DATOS","index":1,"n_rows":126,"n_cols":21,"rows_kept":126,"cut":false,"hidden":true,"merged":[]}
[null,null,"FACULTADES",null,null,null,"OBRA"]
[null,null,"Seleccione una facultad:",null,null,null,"Escoja una opción:"]
[null,null,"Ciencias_de_la_Educación_Humanas_y_Tecnologías",null,null,null,"LIBRO"]
[null,null,"Ciencias_Políticas_y_Administrativas",null,null,null,"CAPÍTULO DE LIBRO"]
[null,null,"Ingeniería",null,null,null,"OBRA ARTÍSTICA"]
[null,null,"Salud",null,null,null,"DISEÑO INDUSTRIAL"]
["TÍTULO",null,null,null,null,null,"PATENTE DE INVENCIÓN","Ciencias_Políticas_y_Administrativas",null,null,null,"Ingeniería",null,null,"Salud"]
["Escoja una opción:",null,null,null,null,null,"SOFTWARE","Administración de Empresas",null,null,null,"Arquitectura",null,null,"Enfermería"]
["PhD.",null,"Ciencias_de_la_Educación_Humanas_y_Tecnologías",null,null,null,"PROTOTIPO","Comunicación",null,null,null,"Ingeniería Agroindustrial",null,null,"Fisioterapia"]
["Máster",null,"Diseño Gráfico",null,null,null,"CREACIONES U OBTENCIONES VEGETALES","Contabilidad y Auditoría",null,null,null,"Ingeniería Ambiental",null,null,"Laboratorio Clínico"]
["Ingeniero(a)",null,"Educación Básica",null,null,null,"OBRA MUSICAL","Derecho",null,null,null,"Ingeniería Civil",null,null,"Medicina"]
["Abogado(a)",null,"Educación Inicial",null,null,null,"MODELO DE UTILIDAD","Economía",null,null,null,"Ingeniería en Tecnologías de la Información",null,null,"Odontología"]
["Doctor(a) (No PhD)",null,"Pedagogía de la Actividad Física y el Deporte",null,null,null,"MARCA","Turismo",null,null,null,"Ingeniería en Telecomunicaciones",null,null,"Psicología Clínica"]
["Licenciado(a)",null,"Pedagogía de la Historia y las Ciencias Sociales ",null,null,null,"BASE DE DATOS",null,null,null,null,"Ingeniería Industrial"]
["Arquitecto(a)",null,"Pedagogía de la Lengua y la Literatura"]
["Tecnólogo",null,"Pedagogía de las Artes y Humanidades"]
["Técnico",null,"Pedagogía de las Ciencias Experimentales "]
["Estudiante",null,"Pedagogía de los Idiomas Nacionales y Extranjeros"]
[null,null,"Psicopedagogía"]
[]
["GRUPOS DE INVESTIGACIÓN",null,null,null,null,null,null,"LÍNEAS DE INVESTIGACIÓN",null,null,null,null,null,null,"LÍNEAS DE INVESTIGACIÓN CON SUBLÍNEAS"]
["Seleccione un grupo:",null,null,null,null,null,"ÁREA DEL CONOCIMIENTO","Seleccione una línea de investigación:",null,null,null,null,null,null,"CIENCIAS_SOCIALES_Y_DEL_COMPORTAMIENTO",null,null,null,null,"INGENIERÍA_INFORMÁTICA"]
["Actividad física, salud y deporte",null,null,null,null,null,"Educación","CIENCIAS_DE_LA_EDUCACIÓN_Y_FORMACIÓN_PROFESIONAL_O_NO_PROFESIONAL",null,null,null,null,{"$f":"MATCH(LINEA1,DATOS!$H$23:$H$39,0)","v":{"$error":"#N/A"}},null,"ECONOMÍA DEL DESARROLLO",null,null,null,null,"MODELADO Y SIMULACIÓN DE SISTEMAS"]
["Análisis contable, tributario y de auditoría para el desarrollo económico y social",null,null,null,null,null,"Ciencias naturales, matemáticas y estadística","CIENCIAS_DE_LA_VIDA",null,null,null,null,{"$f":"MATCH(LINEA2,DATOS!$H$23:$H$39,0)","v":{"$error":"#N/A"}},null,"EMPRENDIMIENTO INNOVACIÓN Y DESARROLLO EMPRESARIAL"]
["Análisis de muestras biológicas y forenses",null,null,null,null,null,"Ciencias sociales, periodismo, información y derecho","CIENCIAS_SOCIALES_Y_DEL_COMPORTAMIENTO",null,null,null,null,{"$f":"MATCH(LINEA3,DATOS!$H$23:$H$39,0)","v":{"$error":"#N/A"}},null,"POLITICA ECONOMICA"]
["Ciudades sostenibles intermedias",null,null,null,null,null,"Ciencias sociales, periodismo, información y derecho","COMUNICACIÓN_Y_CULTURA",null,null,null,null,{"$f":"MATCH(LINEA4,DATOS!$H$23:$H$39,0)","v":{"$error":"#N/A"}}]
["Estudios Interdiciplinarios",null,null,null,null,null,"Artes y humanidades","CULTURA_VISUAL"]
["Cuidados en procesos vitales",null,null,null,null,null,"Ciencias sociales, periodismo, información y derecho","DERECHOS_Y_GARANTIAS_CONSTITUCIONALES"]
["Currículo, procesos, actores y ambientes educativos",null,null,null,null,null,"Ingeniería, industria y construcción","ELECTRÓNICA_TELECOMUNICACIONES_Y_REDES"]
["Desarrollo local y organizacional (DELO)",null,null,null,null,null,"Ciencias sociales, periodismo, información y derecho","GESTIÓN_SOCIOECONÓMICA_CONTABLE_TRIBUTARIA_Y_LABORAL",null,null,null,null,null,null,"INGENIERÍA_CONSTRUCCIÓN_INDUSTRIA_Y_PRODUCCIÓN",null,null,null,null,"MEDIOAMBIENTE_Y_BIODIVERSIDAD"]
["Diseño y cultura visual",null,null,null,null,null,"Ingeniería, industria y construcción","INGENIERÍA_CONSTRUCCIÓN_INDUSTRIA_Y_PRODUCCIÓN",null,null,null,null,null,null,"ARQUITECTURA Y CONSTRUCCIÓN",null,null,null,null,"CALIDAD DEL SUELO"]
["ECOAPLYD",null,null,null,null,null,"Tecnología de la información y la comunicación (tic)","INGENIERÍA_INFORMÁTICA",null,null,null,null,null,null,"PRODUCTIVIDAD Y PROYECTOS DE INFRAESTRUCTURA"]
["Estudios económicos y empresariales para el desarrollo territorial ",null,null,null,null,null,"Ciencias naturales, matemáticas y estadística","MEDIOAMBIENTE_Y_BIODIVERSIDAD"]
["Garantías constitucionales y derechos humanos",null,null,null,null,null,"Patrimonio y saberes ancestrales","PATRIMONIO_Y_SABERES_ANCESTRALES"]
["Salud oral integral",null,null,null,null,null,"Salud y bienestar","SALUD."]
["Gestión y desarrollo de turismo",null,null,null,null,null,"Servicios","SERVICIOS_PERSONALES",null,null,null,null,null,null,"SALUD."]
["Grupo CIEA",null,null,null,null,null,"Salud y bienestar","SERVICIOS_SOCIALES",null,null,null,null,null,null,"ATENCIÓN INTEGRAL DE SALUD INDIVIDUAL FAMILIAR COMUNITARIA E INTERCULTURAL"]
["Investigación vegetal agroindustrial",null,null,null,null,null,"Ingeniería, industria y construcción","SISTEMAS_DE_PRODUCCIÓN_Y_DESARROLLO_AGROINDUSTRIAL",null,null,null,null,null,null,"SALUD PÚBLICA"]
["Medios y artes narrativas e interactivas, convergencias y emergencias en comunicación y cultura digital y educativa I+D+C+i",null,null,null,null,null,"Tecnología de la información y la comunicación (tic)","TICS_EN_LA_EDUCACIÓN"]
["ModSim, investigaciones de modelamiento y simulación",null,null,null,null,null,null,null,null,null,null,null,null,null,"CIENCIAS_DE_LA_EDUCACIÓN_Y_FORMACIÓN_PROFESIONAL_O_NO_PROFESIONAL",null,null,null,null,null,"CULTURA_VISUAL"]
["Neurociencias",null,null,null,null,null,null,null,null,null,null,null,null,null,"No hay sublíneas",null,null,null,null,null,"No hay sublíneas"]
["Neuropsicopedagogía",null,null,null,null,null,null,null,null,null,null,null,null,null,"CIENCIAS_DE_LA_VIDA",null,null,null,null,null,"DERECHOS_Y_GARANTIAS_CONSTITUCIONALES"]
["Producción animal e industrialización",null,null,null,null,null,null,null,null,null,null,null,null,null,"No hay sublíneas",null,null,null,null,null,"No hay sublíneas"]
["Psicología y salud mental",null,null,null,null,null,null,null,null,null,null,null,null,null,"COMUNICACIÓN_Y_CULTURA",null,null,null,null,null,"ELECTRÓNICA_TELECOMUNICACIONES_Y_REDES"]
["Puruhá, arqueología e historia de la nacionalidad Puruhá hasta la actualidad",null,null,null,null,null,null,null,null,null,null,null,null,null,"No hay sublíneas",null,null,null,null,null,"No hay sublíneas"]
["Comunicaciones, ciberseguridad, telemática y tecnologías inclusivas - GI(CT)2I",null,null,null,null,null,null,null,null,null,null,null,null,null,"GESTIÓN_SOCIOECONÓMICA_CONTABLE_TRIBUTARIA_Y_LABORAL",null,null,null,null,null,"PATRIMONIO_Y_SABERES_ANCESTRALES"]
["Razonamiento crítico, filosofía, historia y teoria social",null,null,null,null,null,null,null,null,null,null,null,null,null,"No hay sublíneas",null,null,null,null,null,"No hay sublíneas"]
["Salud integral",null,null,null,null,null,null,null,null,null,null,null,null,null,"SERVICIOS_PERSONALES",null,null,null,null,null,"SERVICIOS_SOCIALES"]
["Salud pública",null,null,null,null,null,null,null,null,null,null,null,null,null,"No hay sublíneas",null,null,null,null,null,"No hay sublíneas"]
["Telecomunicaciones, informática, industria y construcción (TEIIC)",null,null,null,null,null,null,null,null,null,null,null,null,null,null,null,null,null,null,null,"SISTEMAS_DE_PRODUCCIÓN_Y_DESARROLLO_AGROINDUSTRIAL"]
["Telemedicina y educación médica",null,null,null,null,null,null,null,null,null,null,null,null,null,null,null,null,null,null,null,"No hay sublíneas"]
["ESPECDI. Epistemología Pedagógica, Curricular y Didáctica",null,null,null,null,null,null,null,null,null,null,null,null,null,"TICS_EN_LA_EDUCACIÓN"]
["Umayuku",null,null,null,null,null,null,null,null,null,null,null,null,null,"No hay sublíneas"]
["ETZA KURI"]
["INGENIERÍA   Y CONSTRUCCIÓN SUSTENTABLE"]
["HISTORIA Y  PATRIMONIO CULTURAL",null,"Seleccione un campo detallado"]
[null,null,"Educación",null,null,null,null,"Seleccione una opción","Seleccione una opción"]
[null,null,"Formación para docentes de educación preprimaria",null,null,null,null,"Docente","Docente"]
[null,null,"Formación para docentes sin asignaturas de especialización",null,null,null,null,"Estudiante","Estudiante"]
[null,null,"Formación para docentes con asignaturas de especialización",null,null,null,null,"Administrativo","Administrativo"]
[null,null,"Psicopedagogía",null,null,null,null,null,"Investigador Independiente"]
[null,null,"Diseño"]
[null,null,"Artes"]
[null,null,"Historia y Arqueología"]
[null,null,"Idiomas"]
[null,null,"Literatura y lingüística"]
[null,null,"Economía"]
[null,null,"Economía matemática"]
[null,null,"Ciencias Políticas"]
[null,null,"Psicología"]
[null,null,"Estudios Sociales y Culturales"]
[null,null,"Geografía y Territorio"]
[null,null,"Periodismo y Comunicación"]
[null,null,"Derecho"]
[null,null,"Contabilidad y auditoría"]
[null,null,"Gestión Financiera"]
[null,null,"Administración"]
[null,null,"Mercadotecnia y publicidad"]
[null,null,"Información gerencial"]
[null,null,"Comercio"]
[null,null,"Competencias Laborales"]
[null,null,"Biología"]
[null,null,"Biofísica"]
[null,null,"Bioquímica"]
[null,null,"Genética"]
[null,null,"Biodiversidad"]
[null,null,"Medio Ambiente"]
[null,null,"Recursos Naturales Renovables"]
[null,null,"Química"]
[null,null,"Física"]
[null,null,"Matemática"]
[null,null,"Estadística"]
[null,null,"Computación"]
[null,null,"Diseño y Administración de Redes y Bases de Datos"]
[null,null,"Desarrollo y Análisis de Software y Aplicaciones"]
[null,null,"Sistemas de Información"]
[null,null,"Química Aplicada"]
[null,null,"Tecnologías de Protección del Medio Ambiente"]
[null,null,"Electrónica, Automatización y Sonido"]
[null,null,"Mecánica y profesiones afines a la Metalistería"]
[null,null,"Mecatrónica"]
[null,null,"Hidráulica"]
[null,null,"Telecomunicaciones"]
[null,null,"Nanotecnología"]
[null,null,"Procesamiento de Alimentos"]
[null,null,"Materiales"]
[null,null,"Productos Textiles"]
[null,null,"Producción Industrial"]
[null,null,"Seguridad Industrial"]
[null,null,"Diseño Industrial y de Procesos"]
[null,null,"Mantenimiento Industrial"]
[null,null,"Arquitectura, Urbanismo y Restauración"]
[null,null,"Construcción e Ingeniería Civil"]
[null,null,"Producción Agrícola y Ganadera"]
[null,null,"Odontología"]
[null,null,"Medicina"]
[null,null,"Enfermería y Obstetricia"]
[null,null,"Tecnología de Diagnóstico y Tratamiento Médico"]
[null,null,"Terapia y Rehabilitación"]
[null,null,"Asistencia a Adultos Mayores y Discapacitados"]
[null,null,"Asistencia a la Infancia y Servicios para Jóvenes"]
[null,null,"Hotelería y Gastronomía"]
[null,null,"Actividad Física"]
[null,null,"Turismo"]
[null,null,"Prevención y Gestión de Riesgos"]
[null,null,"Salud y Seguridad Ocupacional"]